{"text_format":"1","workbook":"xlsx","n_sheets":5,"sheets":["Questionnaire","Product Information","Dev_Lists","EMDN_IVDR_Lvl5","EMDN level 5"],"not_rendered":{"charts":0,"images":3,"macros":1,"external_links":4,"defined_names":19,"comments":0,"pivot_tables":0},"unopened":[],"bounds":{"document_bytes":16777216,"sheet_cells":100000,"rows_first":2000,"rows_last":500,"rows_between":2000,"halvings":0,"cell_chars":16384,"cell_head_chars":4096},"cells_cut":0,"cells_raw":0,"read":"whole","date_system":"1900"}

{"sheet":"Questionnaire","index":0,"n_rows":20,"n_cols":2,"rows_kept":20,"cut":false,"hidden":false,"merged":[]}
[]
[null,"1. Details about the company and contact person(s)"]
["Name of legal manufacturer:\n(Must be identical to General Agreement with TRLP)"]
["E-Mail (contact person):"]
[]
["Are you seeking certification under Article 16?\n(importers, distributors or other persons)","No"]
[]
[null,"2. Desired Conformity Assessment Procedure"]
["Class A \n(sterile)"]
["Class B"]
["Class C"]
["Class D"]
[]
[null,"3. Technical Documentations"]
["Technical Documentation Language:"]
[{"$f":"IF(B15=Dev_Lists!O5,\"Please specify the language:\",\"\")","v":""}]
["Was consultancy received for the technical documentation?"]
[{"$f":"IF(B17=\"Yes\",\"Consulted by:\",\"\")","v":""}]
["The technical documentation is ready for submission for assessment:"]
[null,"Note: Please remember to fill all sheets in this document, including the \"Product Information\". The \"Product information\" are highly similar to the \"Product List\" required in the \"Product List and Application\"document. "]

{"sheet":"Product Information","index":1,"n_rows":103,"n_cols":21,"rows_kept":103,"cut":false,"hidden":false,"merged":[]}
[]
[null,null,null,null,null,null,null,null,null,null,null,null,null,"        Regulation (EU) 2024/1860"]
["No","Product or Trade name under IVDR \n(as listed on product label and EUDAMED)","Catalogue Number (Ref)","Technical Documentation (TD) Identifier\nOR\n\nEU 2024/1860 application\n(if TD is not ready)\nDeclared date of TD submission\n[YYYY-MM] ","Basic UDI-DI","Classification rule (single selection),\n\nand implementing rule as required\n(see IVDR,\nAnnex VIII)","(highest)\nRisk class ","EMDN code\n(click-> EMDN homepage)\n\n5th level","EMDN description (automatically filled!)","IVR:\n(single selection, exceptions possible for multiplex devices)","IVD:\n(single selection)","IVP:\n(main IVP code)","IVS:\n(multi selection possible)","Name of the IVDD legacy device, if applicable","IVDD Certificate(s) reference of the devices under IVDR application, if appliabel","Intended Use\n(abbreviated version)","Interventional clinical performance study conducted\n(see Annex XIV) ","Devices in sterile condition","Number of additional specific Analytes/Markers","Software that are devices in themselves \n(stand alone SW)","Devices incorporating software/utilising software \n(embedded SW) "]
[1]
[2,null,null,null,null,null,null,null,{"$f":"_xlfn.XLOOKUP(H5,EMDN_IVDR_Lvl5!C:C,PROPER(EMDN_IVDR_Lvl5!L:L))","v":""}]
[3,null,null,null,null,null,null,null,{"$f":"_xlfn.XLOOKUP(H6,EMDN_IVDR_Lvl5!C:C,PROPER(EMDN_IVDR_Lvl5!L:L))","v":""}]
[4,null,null,null,null,null,null,null,{"$f":"_xlfn.XLOOKUP(H7,EMDN_IVDR_Lvl5!C:C,PROPER(EMDN_IVDR_Lvl5!L:L))","v":""}]
[5,null,null,null,null,null,null,null,{"$f":"_xlfn.XLOOKUP(H8,EMDN_IVDR_Lvl5!C:C,PROPER(EMDN_IVDR_Lvl5!L:L))","v":""}]
[6,null,null,null,null,null,null,null,{"$f":"_xlfn.XLOOKUP(H9,EMDN_IVDR_Lvl5!C:C,PROPER(EMDN_IVDR_Lvl5!L:L))","v":""}]
[7,null,null,null,null,null,null,null,{"$f":"_xlfn.XLOOKUP(H10,EMDN_IVDR_Lvl5!C:C,PROPER(EMDN_IVDR_Lvl5!L:L))","v":""}]
[8,null,null,null,null,null,null,null,{"$f":"_xlfn.XLOOKUP(H11,EMDN_IVDR_Lvl5!C:C,PROPER(EMDN_IVDR_Lvl5!L:L))","v":""}]
[9,null,null,null,null,null,null,null,{"$f":"_xlfn.XLOOKUP(H12,EMDN_IVDR_Lvl5!C:C,PROPER(EMDN_IVDR_Lvl5!L:L))","v":""}]
[10,null,null,null,null,null,null,null,{"$f":"_xlfn.XLOOKUP(H13,EMDN_IVDR_Lvl5!C:C,PROPER(EMDN_IVDR_Lvl5!L:L))","v":""}]
[11,null,null,null,null,null,null,null,{"$f":"_xlfn.XLOOKUP(H14,EMDN_IVDR_Lvl5!C:C,PROPER(EMDN_IVDR_Lvl5!L:L))","v":""}]
[12,null,null,null,null,null,null,null,{"$f":"_xlfn.XLOOKUP(H15,EMDN_IVDR_Lvl5!C:C,PROPER(EMDN_IVDR_Lvl5!L:L))","v":""}]
[13,null,null,null,null,null,null,null,{"$f":"_xlfn.XLOOKUP(H16,EMDN_IVDR_Lvl5!C:C,PROPER(EMDN_IVDR_Lvl5!L:L))","v":""}]
[14,null,null,null,null,null,null,null,{"$f":"_xlfn.XLOOKUP(H17,EMDN_IVDR_Lvl5!C:C,PROPER(EMDN_IVDR_Lvl5!L:L))","v":""}]
[15,null,null,null,null,null,null,null,{"$f":"_xlfn.XLOOKUP(H18,EMDN_IVDR_Lvl5!C:C,PROPER(EMDN_IVDR_Lvl5!L:L))","v":""}]
[16,null,null,null,null,null,null,null,{"$f":"_xlfn.XLOOKUP(H19,EMDN_IVDR_Lvl5!C:C,PROPER(EMDN_IVDR_Lvl5!L:L))","v":""}]
[17,null,null,null,null,null,null,null,{"$f":"_xlfn.XLOOKUP(H20,EMDN_IVDR_Lvl5!C:C,PROPER(EMDN_IVDR_Lvl5!L:L))","v":""}]
[18,null,null,null,null,null,null,null,{"$f":"_xlfn.XLOOKUP(H21,EMDN_IVDR_Lvl5!C:C,PROPER(EMDN_IVDR_Lvl5!L:L))","v":""}]
[19,null,null,null,null,null,null,null,{"$f":"_xlfn.XLOOKUP(H22,EMDN_IVDR_Lvl5!C:C,PROPER(EMDN_IVDR_Lvl5!L:L))","v":""}]
[20,null,null,null,null,null,null,null,{"$f":"_xlfn.XLOOKUP(H23,EMDN_IVDR_Lvl5!C:C,PROPER(EMDN_IVDR_Lvl5!L:L))","v":""}]
[21,null,null,null,null,null,null,null,{"$f":"_xlfn.XLOOKUP(H24,EMDN_IVDR_Lvl5!C:C,PROPER(EMDN_IVDR_Lvl5!L:L))","v":""}]
[22,null,null,null,null,null,null,null,{"$f":"_xlfn.XLOOKUP(H25,EMDN_IVDR_Lvl5!C:C,PROPER(EMDN_IVDR_Lvl5!L:L))","v":""}]
[23,null,null,null,null,null,null,null,{"$f":"_xlfn.XLOOKUP(H26,EMDN_IVDR_Lvl5!C:C,PROPER(EMDN_IVDR_Lvl5!L:L))","v":""}]
[24,null,null,null,null,null,null,null,{"$f":"_xlfn.XLOOKUP(H27,EMDN_IVDR_Lvl5!C:C,PROPER(EMDN_IVDR_Lvl5!L:L))","v":""}]
[25,null,null,null,null,null,null,null,{"$f":"_xlfn.XLOOKUP(H28,EMDN_IVDR_Lvl5!C:C,PROPER(EMDN_IVDR_Lvl5!L:L))","v":""}]
[26,null,null,null,null,null,null,null,{"$f":"_xlfn.XLOOKUP(H29,EMDN_IVDR_Lvl5!C:C,PROPER(EMDN_IVDR_Lvl5!L:L))","v":""}]
[27,null,null,null,null,null,null,null,{"$f":"_xlfn.XLOOKUP(H30,EMDN_IVDR_Lvl5!C:C,PROPER(EMDN_IVDR_Lvl5!L:L))","v":""}]
{"$rows_left_out":74}
{"sheet":"Dev_Lists","index":2,"n_rows":35,"n_cols":18,"rows_kept":35,"cut":false,"hidden":true,"merged":[]}
[null,null,null,null,null,null,null,null,null,null,"Desired conf assessment procedures"]
["Yes/No",null,"Risk class","IVR Codes","IVR Codes Full Description","IVR Codes Abbreviated","IVD Codes","IVP Codes","IVP Codes Description","IVS Codes","A","B","C","D","TD Language","TD ready for assessment?","Conformity assessment process","Article 16"]
["Yes","Rule 1","A, sterile","IVR 0101","Devices intended to determine markers of the ABO system [A  (ABO1), B (ABO2), AB (ABO3)]  ","IVR 0101: ABO system blood grouping ","IVD 4001: Bacteriology","IVP 3001","In vitro diagnostic devices which require knowledge regarding agglutination tests","IVS 1001","N/A","N/A","N/A","N/A","English","Technical documentation for all devices is ready for submission","Annex IX chapter I (PLA contains class A sterile device(s) only)","No"]
["No","Rule 2","B","IVR 0102","Devices intended to determine markers of the Rhesus system  [RH1 (D), RHW1, RH2 (C), RH3 (E), RH4 (c), RH5 (e)] ","IVR 0102: Rhesus system blood grouping ","IVD 4002: Clinical Chemistry / Biochemistry","IVP 3002","In vitro diagnostic devices which require knowledge regarding biochemistry","IVS 1002","Annex IX Chapter I","Annex IX Chapter I, II and III","Annex IX Chapter I, II and III","Annex IX Chapter I, II and III","German","Not all technical documentations are ready for submission.\nWe are interested in Confirmation letter according to (EU) 2024/1860","Annex IX chapter I and II","Yes, as distributor"]
[null,"Rule 3 - \n(a)","B, self-testing","IVR 0103","Devices intended to determine markers of the Kell system  [Kel1 (K)] ","IVR 0103: Kell system blood grouping ","IVD 4003: Detection of Transmissible Agents (No organisms/viruses)","IVP 3003","In vitro diagnostic devices which require knowledge regarding chromatography","IVS 1003","Annex XI (Production Quality Assurance incl. parts of the TD)","Annex II + III & Annex XI (Technical Documentation Assessment & Production Quality Assurance)","Annex XI (Production Quality Assurance with existing Type-examination certificate)","Annex XI (Production Quality Assurance with existing Type-examination certificate)","Other EU language (prior approval by TRLP required)","No technical documentation ready for submission.\nWe are interested in Confirmation letter according to (EU) 2024/1860","Annex XI Conformity Assessment based on Production Quality Assurance","Yes, as importer"]
[null,"Rule 3 - \n(b)","B, near-patient testing","IVR 0104","Devices intended to determine markers of the Kidd system  [JK1 (Jka), JK2 (Jkb)]  ","IVR 0104: Kidd system blood grouping ","IVD 4004: Genetics","IVP 3004","In vitro diagnostic devices which require knowledge regarding chromosomal analysis","IVS 1004",null,null,null,null,null,null,null,"Yes, as other persons"]
[null,"Rule 3 - \n(c)","C","IVR 0105","Devices intended to determine markers of the Duffy system  [FY1 (Fya), FY2 (Fyb)]  ","IVR 0105: Duffy system blood grouping ","IVD 4005: Haematology / Haemostasis (+Coagulation Disorders)","IVP 3005","In vitro diagnostic devices which require knowledge regarding coagulometry","IVS 1005"]
[null,"Rule 3 - \n(d)","C, self-testing","IVR 0106","Other devices intended to be used for blood grouping  ","IVR 0106: Other blood grouping ","IVD 4006: Histocompatibility and Immunogenetics","IVP 3006","In vitro diagnostic devices which require knowledge regarding flow cytometry","IVS 1006"]
[null,"Rule 3 - \n(e)","C, near-patient testing","IVR 0201","Devices intended to be used for tissue typing (HLA A, B, DR)  to ensure the immunological compatibility of blood, blood  components, cells, tissue or organs that are intended for  transfusion or transplantation or cell administration  ","IVR 0201: Tissue typing (HLA A, B, DR) to ensure immun. compatibility","IVD 4007: Immunohistochemistry / Histology","IVP 3007","In vitro diagnostic devices which require knowledge regarding immunoassays","IVS 1007"]
[null,"Rule 3 - \n(f)","C, companion diagnostics","IVR 0202","Other devices intended to be used for tissue typing ","IVR 0202: Other tissue typing","IVD 4008: Immunology","IVP 3008","In vitro diagnostic devices which require knowledge regarding lysis based testing","IVS 1008"]
[null,"Rule 3 - \n(g)","D","IVR 0301","Devices intended to be used in screening, diagnosis, staging or  monitoring of cancer ","IVR 0301: Cancer screening, diagnosis, staging or monitoring","IVD 4009: Molecular Biology / Diagnostics\n(in general not to be used, please clarify with TÜV)","IVP 3009","In vitro diagnostic devices which require knowledge regarding measurement of radioactivity","IVS 1009"]
[null,"Rule 3 - \n(h)","D, self-testing","IVR 0302","Other devices intended to be used for markers of cancer and  non-malignant tumours ","IVR 0302: Other cancer and non-malignant tumours","IVD 4010: Mycology","IVP 3010","In vitro diagnostic devices which require knowledge regarding microscopy","IVS 1010"]
[null,"Rule 3 - \n(i)","D, near-patient testing","IVR 0401","Devices intended to be used in screening / confirmation of  congenital / inherited disorders","IVR 0401: Congenital / inherited disorders screening / confirmation","IVD 4011: Parasitology","IVP 3011","In vitro diagnostic devices which require knowledge regarding molecular biological testing including nucleic acid assays and next generation sequencing (NGS)"]
[null,"Rule 3 - \n(j)","D, companion diagnostics","IVR 0402","Devices intended to be used to predict genetic  disease/disorder risk and prognosis  ","IVR 0402: Genetic disease/disorder risk/prognosis","IVD 4012: Virology","IVP 3012","In vitro diagnostic devices which require knowledge regarding physical chemistry including electrochemistry"]
[null,"Rule 3 - \n(k)",null,"IVR 0403","Other devices intended to be used for human genetic testing ","IVR 0403: Other human genetic testing",null,"IVP 3013","In vitro diagnostic devices which require knowledge regarding spectroscopy"]
[null,"Rule 3 - \n(l)",null,"IVR 0501","Devices intended to be used for pre-natal screening of women  in order to determine their immune status towards  transmissible agents  ","IVR 0501: Pre-natal screening to determine immune status towards transmissible agents",null,"IVP 3014","In vitro diagnostic devices which require knowledge regarding tests of cell function"]
[null,"Rule 3 - \n(m)",null,"IVR 0502","Devices intended to be used to detect the presence of, or  exposure to transmissible agents in blood, blood components,  cells, tissues or organs, or in any of their derivatives, to assess  their suitability for transfusion, transplantation or cell  administration  ","IVR 0502: Transmissible agent detection to assess suitability for transfusion/transplantation"]
[null,"Rule 4 - \n(a)",null,"IVR 0503","Devices intended to be used to detect the presence of, or  exposure to an infectious agent including sexually transmitted  agents  ","IVR 0503: Infectious agent detection including sexually transmitted"]
[null,"Rule 4 - \n(b)",null,"IVR 0504","Devices intended to be used to determine the infectious load,  to determine infective disease status or immune status and  devices used for infectious disease staging ","IVR 0504: Infectious load determination and devices used for infectious disease staging"]
[null,"Rule 5 - \n(a)",null,"IVR 0505","Devices intended to be used to grow / isolate / identify and  handle infectious agents  ","IVR 0505: Infectious agents growth/isolation/identification and handling"]
[null,"Rule 5 - \n(b)",null,"IVR 0506","Other devices intended to be used to determine markers of  infections / immune status","IVR 0506: Other markers of infections/immune status"]
[null,"Rule 5 - \n(c)",null,"IVR 0601","Devices intended to be used for screening / confirmation of  specific disorders / impairments ","IVR 0601: Specific disorders/impairments"]
[null,"Rule 6",null,"IVR 0602"," Devices intended to be used for screening, determination or  monitoring of physiological markers for a specific disease","IVR 0602: Physiological markers for a specific disease"]
[null,"Rule 7",null,"IVR 0603","Devices intended to be used for screening, confirmation /  determination, or monitoring of allergies and intolerances  ","IVR 0603: Allergies and intolerances"]
[null,"Implementation Rule 1.5",null,"IVR 0604","Other devices intended to be used for a specific disease ","IVR 0604: Other specific disease"]
[null,"Implementation Rule 1.6",null,"IVR 0605","Devices intended to be used for monitoring of levels of  medicinal products, substances or biological components ","IVR 0605: Medicinal products, substances or biological components levels"]
[null,null,null,"IVR 0606","Devices intended to be used for non-infectious disease staging ","IVR 0606: Non-infectious disease staging"]
[null,null,null,"IVR 0607","Devices intended to be used for detection of pregnancy or  fertility testing ","IVR 0607: Pregnancy or fertility testing"]
[null,null,null,"IVR 0608","Devices intended to be used for screening, determination or  monitoring of physiological markers  ","IVR 0608: Physiological markers"]
[null,null,null,"IVR 0609","Other devices intended to be used to define or monitor  physiological status and therapeutic measures  ","IVR 0609: Other physiological status and therapeutic measures"]
{"$rows_left_out":6}
{"sheet":"EMDN_IVDR_Lvl5","index":3,"n_rows":592,"n_cols":13,"rows_kept":592,"cut":false,"hidden":true,"merged":[]}
["ID","CATEGORY","EMDN CODE","CODE","LEVEL ","BOTTOM LEVEL YES/NO ","Level","Bottom Level","CATEGORY DESCRIPTION ITALIAN_29092021","EMDN  IT DESCRIPTION_29092021","CATEGORY DESCRIPTION_29092021","EMDN EN DESCRIPTION_29092021","EMDN EN DESCRIPTION_29092021 (non capital)"]
[4507,"W","W01010101","W01010101",5,"YES",{"$f":"C2=D2","v":true},null,"DISPOSITIVI MEDICO - DIAGNOSTICI IN VITRO","5'-NUCLEOTIDASI ","IN VITRO DIAGNOSTIC MEDICAL DEVICES ","5'-NUCLEOTIDASE",{"$f":"PROPER(L2)","v":"5'-Nucleotidase"}]
[4508,"W","W01010102","W01010102",5,"YES",true,null,"DISPOSITIVI MEDICO - DIAGNOSTICI IN VITRO","FOSFATASI ACIDA","IN VITRO DIAGNOSTIC MEDICAL DEVICES ","ACID PHOSPHATASE (CC)",{"$f":"PROPER(L3)","v":"Acid Phosphatase (Cc)"}]
[4509,"W","W01010103","W01010103",5,"YES",true,null,"DISPOSITIVI MEDICO - DIAGNOSTICI IN VITRO","ALANINA AMINOTRANSFERASI","IN VITRO DIAGNOSTIC MEDICAL DEVICES ","ALANINE AMINO-TRANSFERASE","Alanine Amino-Transferase"]
[4510,"W","W01010104","W01010104",5,"YES",true,null,"DISPOSITIVI MEDICO - DIAGNOSTICI IN VITRO","ALDOLASI","IN VITRO DIAGNOSTIC MEDICAL DEVICES ","ALDOLASE","Aldolase"]
[4511,"W","W01010105","W01010105",5,"YES",true,null,"DISPOSITIVI MEDICO - DIAGNOSTICI IN VITRO","FOSFATASI ALCALINA - TOTALE","IN VITRO DIAGNOSTIC MEDICAL DEVICES ","ALKALINE PHOSPHATASE - TOTAL","Alkaline Phosphatase - Total"]
[4512,"W","W01010106","W01010106",5,"YES",true,null,"DISPOSITIVI MEDICO - DIAGNOSTICI IN VITRO","FOSFATASI ALCALINA ISOENZIMI","IN VITRO DIAGNOSTIC MEDICAL DEVICES ","ALKALINE PHOSPHATASE ISOENZYMES (CC)","Alkaline Phosphatase Isoenzymes (Cc)"]
[4513,"W","W01010107","W01010107",5,"YES",true,null,"DISPOSITIVI MEDICO - DIAGNOSTICI IN VITRO","AMILASI - TOTALE","IN VITRO DIAGNOSTIC MEDICAL DEVICES ","AMYLASE - TOTAL","Amylase - Total"]
[4514,"W","W01010108","W01010108",5,"YES",true,null,"DISPOSITIVI MEDICO - DIAGNOSTICI IN VITRO","ISOENZIMI AMILASI","IN VITRO DIAGNOSTIC MEDICAL DEVICES ","AMYLASE ISOENZYMES","Amylase Isoenzymes"]
[4515,"W","W01010109","W01010109",5,"YES",true,null,"DISPOSITIVI MEDICO - DIAGNOSTICI IN VITRO","ANGIOTENSINA ENZIMA CONVERTITORE (ACE)","IN VITRO DIAGNOSTIC MEDICAL DEVICES ","ANGIOTENSIN CONVERTING ENZYME (CC)","Angiotensin Converting Enzyme (Cc)"]
[4516,"W","W01010110","W01010110",5,"YES",true,null,"DISPOSITIVI MEDICO - DIAGNOSTICI IN VITRO","ASPARTATO AMINOTRANSFERASI","IN VITRO DIAGNOSTIC MEDICAL DEVICES ","ASPARTATE AMINO-TRANSFERASE","Aspartate Amino-Transferase"]
[4517,"W","W01010111","W01010111",5,"YES",true,null,"DISPOSITIVI MEDICO - DIAGNOSTICI IN VITRO","COLINESTERASI","IN VITRO DIAGNOSTIC MEDICAL DEVICES ","CHOLINESTERASE","Cholinesterase"]
[4518,"W","W01010112","W01010112",5,"YES",true,null,"DISPOSITIVI MEDICO - DIAGNOSTICI IN VITRO","CHIMOTRIPSINA","IN VITRO DIAGNOSTIC MEDICAL DEVICES ","CHYMOTRYPSIN","Chymotrypsin"]
[4519,"W","W01010113","W01010113",5,"YES",true,null,"DISPOSITIVI MEDICO - DIAGNOSTICI IN VITRO","CREATINCHINASI - TOTALE","IN VITRO DIAGNOSTIC MEDICAL DEVICES ","CREATINE KINASE - TOTAL","Creatine Kinase - Total"]
[4520,"W","W01010114","W01010114",5,"YES",true,null,"DISPOSITIVI MEDICO - DIAGNOSTICI IN VITRO","CREATINCHINASI ISOENZIMA MB \"ATTIVITA'\"","IN VITRO DIAGNOSTIC MEDICAL DEVICES ","CREATINE KINASE - MB ACTIVITY (CC)","Creatine Kinase - Mb Activity (Cc)"]
[4521,"W","W01010115","W01010115",5,"YES",true,null,"DISPOSITIVI MEDICO - DIAGNOSTICI IN VITRO","CREATINCHINASI ISOENZIMI","IN VITRO DIAGNOSTIC MEDICAL DEVICES ","CREATINE KINASE ISOENZYMES","Creatine Kinase Isoenzymes"]
[4522,"W","W01010116","W01010116",5,"YES",true,null,"DISPOSITIVI MEDICO - DIAGNOSTICI IN VITRO","GAMMA GLUTAMILTRANSFERASI","IN VITRO DIAGNOSTIC MEDICAL DEVICES ","GAMMA GLUTAMYLTRANSFERASE","Gamma Glutamyltransferase"]
[4523,"W","W01010117","W01010117",5,"YES",true,null,"DISPOSITIVI MEDICO - DIAGNOSTICI IN VITRO","GLUTAMMATO DEIDROGENASI","IN VITRO DIAGNOSTIC MEDICAL DEVICES ","GLUTAMATE DEHYDROGENASE","Glutamate Dehydrogenase"]
[4524,"W","W01010118","W01010118",5,"YES",true,null,"DISPOSITIVI MEDICO - DIAGNOSTICI IN VITRO","IDROSSIBUTIRRATO DEIDROGENASI","IN VITRO DIAGNOSTIC MEDICAL DEVICES ","HYDROXYBUTYRATE DEHYDROGENASE","Hydroxybutyrate Dehydrogenase"]
[4525,"W","W01010119","W01010119",5,"YES",true,null,"DISPOSITIVI MEDICO - DIAGNOSTICI IN VITRO","LATTATO DEIDROGENASI L ( LDH - L --> P )","IN VITRO DIAGNOSTIC MEDICAL DEVICES ","LACTATE DEHYDROGENASE L  ( LDH - L --> P )","Lactate Dehydrogenase L  ( Ldh - L --> P )"]
[4526,"W","W01010120","W01010120",5,"YES",true,null,"DISPOSITIVI MEDICO - DIAGNOSTICI IN VITRO","LATTATO DEIDROGENASI P ( LDH - P --> L )","IN VITRO DIAGNOSTIC MEDICAL DEVICES ","LACTATE DEHYDROGENASE P ( LDH - P --> L )","Lactate Dehydrogenase P ( Ldh - P --> L )"]
[4527,"W","W01010121","W01010121",5,"YES",true,null,"DISPOSITIVI MEDICO - DIAGNOSTICI IN VITRO","LATTATO DEIDROGENASI ISOENZIMI","IN VITRO DIAGNOSTIC MEDICAL DEVICES ","LACTATE DEHYDROGENASE ISOENZYMES","Lactate Dehydrogenase Isoenzymes"]
[4528,"W","W01010122","W01010122",5,"YES",true,null,"DISPOSITIVI MEDICO - DIAGNOSTICI IN VITRO","LEUCINA AMINO PEPTIDASI","IN VITRO DIAGNOSTIC MEDICAL DEVICES ","LEUCINE AMINOPEPTIDASE","Leucine Aminopeptidase"]
[4529,"W","W01010123","W01010123",5,"YES",true,null,"DISPOSITIVI MEDICO - DIAGNOSTICI IN VITRO","LIPASI","IN VITRO DIAGNOSTIC MEDICAL DEVICES ","LIPASE","Lipase"]
[4530,"W","W01010124","W01010124",5,"YES",true,null,"DISPOSITIVI MEDICO - DIAGNOSTICI IN VITRO","LISOZIMA","IN VITRO DIAGNOSTIC MEDICAL DEVICES ","LYSOZYME","Lysozyme"]
[4531,"W","W01010125","W01010125",5,"YES",true,null,"DISPOSITIVI MEDICO - DIAGNOSTICI IN VITRO","MALATO DEIDROGENASI","IN VITRO DIAGNOSTIC MEDICAL DEVICES ","MALATE DEHYDROGENASE","Malate Dehydrogenase"]
[4532,"W","W01010126","W01010126",5,"YES",true,null,"DISPOSITIVI MEDICO - DIAGNOSTICI IN VITRO","N-ACETYL-ß,D-GLUCOSAMINIDASI","IN VITRO DIAGNOSTIC MEDICAL DEVICES ","N-ACETYL-B, D-GLUCOSAMINIDASE","N-Acetyl-B, D-Glucosaminidase"]
[4533,"W","W01010127","W01010127",5,"YES",true,null,"DISPOSITIVI MEDICO - DIAGNOSTICI IN VITRO","PEPSINA","IN VITRO DIAGNOSTIC MEDICAL DEVICES ","PEPSIN","Pepsin"]
[4534,"W","W01010128","W01010128",5,"YES",true,null,"DISPOSITIVI MEDICO - DIAGNOSTICI IN VITRO","FOSFOESOMERASI","IN VITRO DIAGNOSTIC MEDICAL DEVICES ","PHOSPHO HEXOSE ISOMERASE","Phospho Hexose Isomerase"]
[4535,"W","W01010129","W01010129",5,"YES",true,null,"DISPOSITIVI MEDICO - DIAGNOSTICI IN VITRO","SORBITOLO DEIDROGENASI","IN VITRO DIAGNOSTIC MEDICAL DEVICES ","SORBITOL DEHYDROGENASE","Sorbitol Dehydrogenase"]
{"$rows_left_out":563}
{"sheet":"EMDN level 5","index":4,"n_rows":554,"n_cols":2,"rows_kept":554,"cut":false,"hidden":true,"merged":[]}
[]
[null,"CND CODE"]
[null,"W01010101"]
[null,"W01010102"]
[null,"W01010103"]
[null,"W01010104"]
[null,"W01010105"]
[null,"W01010106"]
[null,"W01010107"]
[null,"W01010108"]
[null,"W01010109"]
[null,"W01010110"]
[null,"W01010111"]
[null,"W01010112"]
[null,"W01010113"]
[null,"W01010114"]
[null,"W01010115"]
[null,"W01010116"]
[null,"W01010117"]
[null,"W01010118"]
[null,"W01010119"]
[null,"W01010120"]
[null,"W01010121"]
[null,"W01010122"]
[null,"W01010123"]
[null,"W01010124"]
[null,"W01010125"]
[null,"W01010126"]
[null,"W01010127"]
[null,"W01010128"]
{"$rows_left_out":524}